tests: Assert that capsule-capture-libs --library-knowledge works

Signed-off-by: Simon McVittie <smcv@collabora.com>
6 jobs for cmp-by-elf in 5 minutes (queued for 1 second)
Status Job ID Name Coverage
  Test
manual #40194
allowed to fail manual
build:arch
failed #40190
build:asan

00:02:47

failed #40193
build:bionic

00:03:39

failed #40192
build:buster

00:03:50

failed #40191
build:stretch

00:03:41

failed #40189
build:ubsan

00:02:57

 
Name Stage Failure
failed
build:bionic Test
Makefile:3071: recipe for target 'check-TESTS' failed
make[2]: Leaving directory '/tmp/build-snapshot.cD731Bwuo8/s'
Makefile:3288: recipe for target 'check-am' failed
make[1]: *** [check-am] Error 2
make[1]: Leaving directory '/tmp/build-snapshot.cD731Bwuo8/s'
Makefile:3290: recipe for target 'check' failed
make: *** [check] Error 2
ERROR:deb-build-snapshot:Command 'cd /tmp/build-snapshot.cD731Bwuo8/s && env PATH=/usr/lib/ccache:/usr/local/sbin:/usr/local/bin:/usr/sbin:/usr/bin:/sbin:/bin make -j5 check VERBOSE=1' returned non-zero exit status 2.
ERROR: Job failed: exit code 1
failed
build:buster Test
============================================================================
make[3]: Leaving directory '/tmp/build-snapshot.l4Nyfov8BD/s'
make[2]: Leaving directory '/tmp/build-snapshot.l4Nyfov8BD/s'
make[1]: Leaving directory '/tmp/build-snapshot.l4Nyfov8BD/s'
make[2]: *** [Makefile:3127: check-TESTS] Error 2
make[1]: *** [Makefile:3344: check-am] Error 2
make: *** [Makefile:3346: check] Error 2
ERROR:deb-build-snapshot:Command 'cd /tmp/build-snapshot.l4Nyfov8BD/s && env PATH=/usr/lib/ccache:/usr/local/sbin:/usr/local/bin:/usr/sbin:/usr/bin:/sbin:/bin make -j5 check VERBOSE=1' returned non-zero exit status 2.
ERROR: Job failed: exit code 1
failed
build:stretch Test
make[2]: Leaving directory '/tmp/build-snapshot.iQoRPZCWon/s'
Makefile:3270: recipe for target 'check-am' failed
make[1]: Leaving directory '/tmp/build-snapshot.iQoRPZCWon/s'
Makefile:3272: recipe for target 'check' failed
make[2]: *** [check-TESTS] Error 2
make[1]: *** [check-am] Error 2
make: *** [check] Error 2
ERROR:deb-build-snapshot:Command 'cd /tmp/build-snapshot.iQoRPZCWon/s && env PATH=/usr/lib/ccache:/usr/local/sbin:/usr/local/bin:/usr/sbin:/usr/bin:/sbin:/bin make -j5 check VERBOSE=1' returned non-zero exit status 2
ERROR: Job failed: exit code 1
failed
build:ubsan Test
============================================================================
make[3]: Leaving directory '/builds/smcv/libcapsule'
make[3]: *** [Makefile:3019: test-suite.log] Error 1
make[2]: *** [Makefile:3127: check-TESTS] Error 2
make[2]: Leaving directory '/builds/smcv/libcapsule'
make[1]: *** [Makefile:3344: check-am] Error 2
make[1]: Leaving directory '/builds/smcv/libcapsule'
make: *** [Makefile:3346: check] Error 2
ERROR: Job failed: exit code 1
failed
build:asan Test
============================================================================
make[3]: *** [Makefile:3019: test-suite.log] Error 1
make[3]: Leaving directory '/builds/smcv/libcapsule'
make[2]: *** [Makefile:3127: check-TESTS] Error 2
make[2]: Leaving directory '/builds/smcv/libcapsule'
make[1]: *** [Makefile:3344: check-am] Error 2
make[1]: Leaving directory '/builds/smcv/libcapsule'
make: *** [Makefile:3346: check] Error 2
ERROR: Job failed: exit code 1